Target
Probable G-protein coupled receptor 160
Ligand
BDBM281718
Substrate
Meas. Tech.
GPR120 pERK AlphaScreen SureFire Assay
Temperature
298.15±n/a K
EC50
520±n/a nM
Comments
extracted
Citation
 Shi, YWang, YCheng, PTWu, SC Cyclobutane containing carboxylic acid GPR120 modulators US Patent  US10023519 Publication Date 7/17/2018 
Target
Name:
Probable G-protein coupled receptor 160
Synonyms:
G-protein coupled receptor GPCR1 GPCR150 hGPCR1
Type:
Enzyme Catalytic Domain
Mol. Mass.:
39797.81
Organism:
Homo sapiens (Human)
Description:
Residue:
338
  
Inhibitor
Name:
BDBM281718
Synonyms:
2-(3-(Cis-3-(3-phenoxybenzyloxy)cyclobutyl)propoxy)acetic acid | US10023519, Example 59
Type:
Small organic molecule
Emp. Form.:
C22H26O5
Mol. Mass.:
370.4388
SMILES:
OC(=O)COCCC[C@H]1C[C@H](C1)OCc1cccc(Oc2ccccc2)c1
: