Target
Probable G-protein coupled receptor 160
Ligand
BDBM281721
Substrate
Meas. Tech.
GPR120 pERK AlphaScreen SureFire Assay
Temperature
298.15±n/a K
EC50
570±n/a nM
Comments
extracted
Citation
 Shi, YWang, YCheng, PTWu, SC Cyclobutane containing carboxylic acid GPR120 modulators US Patent  US10023519 Publication Date 7/17/2018 
Target
Name:
Probable G-protein coupled receptor 160
Synonyms:
G-protein coupled receptor GPCR1 GPCR150 hGPCR1
Type:
Enzyme Catalytic Domain
Mol. Mass.:
39797.81
Organism:
Homo sapiens (Human)
Description:
Residue:
338
  
Inhibitor
Name:
BDBM281721
Synonyms:
3-(3-(Cis-1-methyl-3-(3-phenoxyphenyl)cyclobutyl)propoxy)propanoic acid | US10023519, Example 62
Type:
Small organic molecule
Emp. Form.:
C23H28O4
Mol. Mass.:
368.466
SMILES:
C[C@@]1(CCCOCCC(O)=O)C[C@@H](C1)c1cccc(Oc2ccccc2)c1
: