Target
Kininogen-1
Ligand
BDBM107162
Substrate
Meas. Tech.
Binding Assay
Ki
41.6±n/a nM
Citation
 Aebi, JBinggeli, AHertel, CKonkar, AAKuehne, HKuhn, BMaerki, HPWang, H Aryl-benzocycloalkyl amide derivatives US Patent  US8592426 Publication Date 11/26/2013 
Target
Name:
Kininogen-1
Synonyms:
BDK KNG KNG1_HUMAN
Type:
Enzyme
Mol. Mass.:
71962.11
Organism:
Homo sapiens (Human)
Description:
P01042
Residue:
644
  
Inhibitor
Name:
BDBM107162
Synonyms:
US8592426, 11
Type:
Small organic molecule
Emp. Form.:
C25H21ClF4N4O3
Mol. Mass.:
536.906
SMILES:
Cc1nc(no1)-c1c(F)cc(Cl)cc1-c1ccc2C(CCCc2c1)NC(=O)C1(CC1)NC(=O)C(F)(F)F
: