Target
Kininogen-1
Ligand
BDBM107175
Substrate
Meas. Tech.
Binding Assay
Ki
36.4±n/a nM
Citation
 Aebi, JBinggeli, AHertel, CKonkar, AAKuehne, HKuhn, BMaerki, HPWang, H Aryl-benzocycloalkyl amide derivatives US Patent  US8592426 Publication Date 11/26/2013 
Target
Name:
Kininogen-1
Synonyms:
BDK KNG KNG1_HUMAN
Type:
Enzyme
Mol. Mass.:
71962.11
Organism:
Homo sapiens (Human)
Description:
P01042
Residue:
644
  
Inhibitor
Name:
BDBM107175
Synonyms:
US8592426, 24
Type:
Emp. Form.:
C22H20ClFN4O2
Mol. Mass.:
426.871
SMILES:
Cc1nc(no1)-c1c(F)cc(Cl)cc1-c1ccc2[C@H](CCc2c1)NC(=O)C1(N)CC1
: