Target
Kininogen-1
Ligand
BDBM107185
Substrate
Meas. Tech.
Binding Assay
Ki
15.1±n/a nM
Citation
 Aebi, JBinggeli, AHertel, CKonkar, AAKuehne, HKuhn, BMaerki, HPWang, H Aryl-benzocycloalkyl amide derivatives US Patent  US8592426 Publication Date 11/26/2013 
Target
Name:
Kininogen-1
Synonyms:
BDK KNG KNG1_HUMAN
Type:
Enzyme
Mol. Mass.:
71962.11
Organism:
Homo sapiens (Human)
Description:
P01042
Residue:
644
  
Inhibitor
Name:
BDBM107185
Synonyms:
US8592426, 34
Type:
Small organic molecule
Emp. Form.:
C27H21ClF2N6O3
Mol. Mass.:
550.944
SMILES:
Cc1nc(no1)-c1c(F)cc(Cl)cc1-c1cc2CCC(NC(=O)C3(CC3)NC(=O)c3ccnnc3)c2c(F)c1
: