Target
Kininogen-1
Ligand
BDBM107200
Substrate
Meas. Tech.
Binding Assay
Ki
4.8±n/a nM
Citation
 Aebi, JBinggeli, AHertel, CKonkar, AAKuehne, HKuhn, BMaerki, HPWang, H Aryl-benzocycloalkyl amide derivatives US Patent  US8592426 Publication Date 11/26/2013 
Target
Name:
Kininogen-1
Synonyms:
BDK KNG KNG1_HUMAN
Type:
Enzyme
Mol. Mass.:
71962.11
Organism:
Homo sapiens (Human)
Description:
P01042
Residue:
644
  
Inhibitor
Name:
BDBM107200
Synonyms:
US8592426, 50
Type:
Emp. Form.:
C27H22ClFN6O4
Mol. Mass.:
548.953
SMILES:
Cc1nc(no1)-c1c(F)cc(Cl)cc1-c1ccc2[C@H](CCc2c1)NC(=O)C1(COC1)NC(=O)c1cncnc1
: