Target
Kininogen-1
Ligand
BDBM107212
Substrate
Meas. Tech.
Binding Assay
Ki
4.8±n/a nM
Citation
 Aebi, JBinggeli, AHertel, CKonkar, AAKuehne, HKuhn, BMaerki, HPWang, H Aryl-benzocycloalkyl amide derivatives US Patent  US8592426 Publication Date 11/26/2013 
Target
Name:
Kininogen-1
Synonyms:
BDK KNG KNG1_HUMAN
Type:
Enzyme
Mol. Mass.:
71962.11
Organism:
Homo sapiens (Human)
Description:
P01042
Residue:
644
  
Inhibitor
Name:
BDBM107212
Synonyms:
US8592426, 63
Type:
Small organic molecule
Emp. Form.:
C25H20ClFN8O2S
Mol. Mass.:
550.995
SMILES:
Cn1nnc(n1)-c1c(F)cc(Cl)cc1-c1ccc2C(CSc2c1)NC(=O)C1(CC1)NC(=O)c1cncnc1
: