Target
Kininogen-1
Ligand
BDBM107163
Substrate
Meas. Tech.
Calcium Mobilization Assay
IC50
0.5±n/a nM
Citation
 Aebi, JBinggeli, AHertel, CKonkar, AAKuehne, HKuhn, BMaerki, HPWang, H Aryl-benzocycloalkyl amide derivatives US Patent  US8592426 Publication Date 11/26/2013 
Target
Name:
Kininogen-1
Synonyms:
BDK KNG KNG1_HUMAN
Type:
Enzyme
Mol. Mass.:
71962.11
Organism:
Homo sapiens (Human)
Description:
P01042
Residue:
644
  
Inhibitor
Name:
BDBM107163
Synonyms:
US8592426, 12
Type:
Small organic molecule
Emp. Form.:
C23H18ClF4N5O3
Mol. Mass.:
523.867
SMILES:
Cc1nc(no1)-c1c(F)cc(Cl)cc1-c1cnc2C(CCc2c1)NC(=O)C1(CC1)NC(=O)C(F)(F)F
: