Target
Kininogen-1
Ligand
BDBM107171
Substrate
Meas. Tech.
Calcium Mobilization Assay
IC50
3.6±n/a nM
Citation
 Aebi, JBinggeli, AHertel, CKonkar, AAKuehne, HKuhn, BMaerki, HPWang, H Aryl-benzocycloalkyl amide derivatives US Patent  US8592426 Publication Date 11/26/2013 
Target
Name:
Kininogen-1
Synonyms:
BDK KNG KNG1_HUMAN
Type:
Enzyme
Mol. Mass.:
71962.11
Organism:
Homo sapiens (Human)
Description:
P01042
Residue:
644
  
Inhibitor
Name:
BDBM107171
Synonyms:
US8592426, 20
Type:
Small organic molecule
Emp. Form.:
C22H17ClF4N6O3
Mol. Mass.:
524.855
SMILES:
Cn1nnc(n1)-c1c(F)cc(Cl)cc1-c1ccc2C(COc2c1)NC(=O)C1(CC1)NC(=O)C(F)(F)F
: