Target
Kininogen-1
Ligand
BDBM107194
Substrate
Meas. Tech.
Calcium Mobilization Assay
IC50
0.3±n/a nM
Citation
 Aebi, JBinggeli, AHertel, CKonkar, AAKuehne, HKuhn, BMaerki, HPWang, H Aryl-benzocycloalkyl amide derivatives US Patent  US8592426 Publication Date 11/26/2013 
Target
Name:
Kininogen-1
Synonyms:
BDK KNG KNG1_HUMAN
Type:
Enzyme
Mol. Mass.:
71962.11
Organism:
Homo sapiens (Human)
Description:
P01042
Residue:
644
  
Inhibitor
Name:
BDBM107194
Synonyms:
US8592426, 43
Type:
Small organic molecule
Emp. Form.:
C25H20ClFN6O4
Mol. Mass.:
522.916
SMILES:
Cc1nc(no1)-c1c(F)cc(Cl)cc1-c1cnc2C(CCc2c1)NC(=O)C1(CC1)NC(=O)c1ccno1
: