Target
Kininogen-1
Ligand
BDBM107205
Substrate
Meas. Tech.
Calcium Mobilization Assay
IC50
61.1±n/a nM
Citation
 Aebi, JBinggeli, AHertel, CKonkar, AAKuehne, HKuhn, BMaerki, HPWang, H Aryl-benzocycloalkyl amide derivatives US Patent  US8592426 Publication Date 11/26/2013 
Target
Name:
Kininogen-1
Synonyms:
BDK KNG KNG1_HUMAN
Type:
Enzyme
Mol. Mass.:
71962.11
Organism:
Homo sapiens (Human)
Description:
P01042
Residue:
644
  
Inhibitor
Name:
BDBM107205
Synonyms:
US8592426, 55
Type:
Small organic molecule
Emp. Form.:
C20H19ClFN7O
Mol. Mass.:
427.863
SMILES:
Cn1nnc(n1)-c1c(F)cc(Cl)cc1-c1cnc2C(CCc2c1)NC(=O)C1(N)CC1
: