Target
Kininogen-1
Ligand
BDBM107208
Substrate
Meas. Tech.
Calcium Mobilization Assay
IC50
0.4±n/a nM
Citation
 Aebi, JBinggeli, AHertel, CKonkar, AAKuehne, HKuhn, BMaerki, HPWang, H Aryl-benzocycloalkyl amide derivatives US Patent  US8592426 Publication Date 11/26/2013 
Target
Name:
Kininogen-1
Synonyms:
BDK KNG KNG1_HUMAN
Type:
Enzyme
Mol. Mass.:
71962.11
Organism:
Homo sapiens (Human)
Description:
P01042
Residue:
644
  
Inhibitor
Name:
BDBM107208
Synonyms:
US8592426, 58
Type:
Small organic molecule
Emp. Form.:
C25H22ClFN8O3
Mol. Mass.:
536.945
SMILES:
Cc1cc(on1)C(=O)NC1(CC1)C(=O)NC1CCc2cc(cnc12)-c1cc(Cl)cc(F)c1-c1nnn(C)n1
: