Target
Acetyl-coenzyme A transporter 1
Ligand
BDBM47105
Substrate
Meas. Tech.
Binding Assay
IC50
2.4±n/a nM
Citation
 Maekawa, TIgawa, H Fused ring compound and use thereof US Patent  US8592431 Publication Date 11/26/2013 
Target
Name:
Acetyl-coenzyme A transporter 1
Synonyms:
ACATN AT1 SLC33A1
Type:
Enzyme
Mol. Mass.:
60911.27
Organism:
Homo sapiens (Human)
Description:
O00400
Residue:
549
  
Inhibitor
Name:
BDBM47105
Synonyms:
US8592431, 124
Type:
Emp. Form.:
C28H28N6O4
Mol. Mass.:
512.5597
SMILES:
CCCc1c(Cc2ccc(cc2)-c2ccccc2-c2noc(=O)[nH]2)c(=O)n(C2CCCOC2)c2ncnn12
: