Target
Cytochrome P450 2C9
Ligand
BDBM107473
Substrate
Meas. Tech.
Biological Assay Example 7
Temperature
310.15±n/a K
IC50
>5.0e+4±n/a nM
Comments
extracted
Citation
 Claremon, DAZhuang, LLeftheris, KTice, CMYe, YSingh, SBHimmelsbach, F Cyclic inhibitors of 11BETA-hydroxysteroid dehydrogenase 1 US Patent  US8592410 Publication Date 11/26/2013 
Target
Name:
Cytochrome P450 2C9
Synonyms:
(R)-limonene 6-monooxygenase CP2C9_HUMAN CYP2C9 Cytochrome P450 2C9 (CYP2C9 ) P-450MP P450 PB-1 | S-mephenytoin 4-hydroxylase
Type:
Enzyme
Mol. Mass.:
55636.33
Organism:
Homo sapiens (Human)
Description:
P11712
Residue:
490
  
Inhibitor
Name:
BDBM107473
Synonyms:
US8592410, 13
Type:
Small organic molecule
Emp. Form.:
C27H30FN3O4
Mol. Mass.:
479.5432
SMILES:
C[C@H](N1CC[C@@](CC(C)(C)O)(OC1=O)c1ccc(F)cc1)c1ccc(cc1)-c1ccc(=O)n(C)n1
: