Target
Cytochrome P450 2C19
Ligand
BDBM50353405
Substrate
Meas. Tech.
Biological Assay Example 8
IC50
5.6e+3±n/a nM
Citation
 Claremon, DAZhuang, LLeftheris, KTice, CMYe, YSingh, SBHimmelsbach, F Cyclic inhibitors of 11BETA-hydroxysteroid dehydrogenase 1 US Patent  US8592410 Publication Date 11/26/2013 
Target
Name:
Cytochrome P450 2C19
Synonyms:
CP2CJ_HUMAN CYPIIC17 Cytochrome P450 2C19 (CYP2C19) Mephenytoin 4-hydroxylase P450-254C
Type:
Enzyme
Mol. Mass.:
55935.47
Organism:
Homo sapiens (Human)
Description:
P33261
Residue:
490
  
Inhibitor
Name:
BDBM50353405
Synonyms:
CHEMBL1829759 US8592410, 93 | US8592410, Comparator 8
Type:
Small organic molecule
Emp. Form.:
C27H27F2NO3
Mol. Mass.:
451.505
SMILES:
C[C@H](N1CC[C@@](CCCO)(OC1=O)c1ccccc1)c1ccc(cc1)-c1ccc(F)cc1F
: