Target
Cytochrome P450 2C9
Ligand
BDBM50353386
Substrate
Meas. Tech.
Biological Assay Example 9
IC50
4.9e+3±n/a nM
Citation
 Claremon, DAZhuang, LLeftheris, KTice, CMYe, YSingh, SBHimmelsbach, F Cyclic inhibitors of 11BETA-hydroxysteroid dehydrogenase 1 US Patent  US8592410 Publication Date 11/26/2013 
Target
Name:
Cytochrome P450 2C9
Synonyms:
(R)-limonene 6-monooxygenase CP2C9_HUMAN CYP2C9 Cytochrome P450 2C9 (CYP2C9 ) P-450MP P450 PB-1 | S-mephenytoin 4-hydroxylase
Type:
Enzyme
Mol. Mass.:
55636.33
Organism:
Homo sapiens (Human)
Description:
P11712
Residue:
490
  
Inhibitor
Name:
BDBM50353386
Synonyms:
CHEMBL1829763 US8592410, Comparator 3 | US8598163, 61
Type:
Small organic molecule
Emp. Form.:
C26H24F3NO3
Mol. Mass.:
455.4689
SMILES:
C[C@H](N1CC[C@@](CCO)(OC1=O)c1ccc(F)cc1)c1ccc(cc1)-c1ccc(F)cc1F
: