Target
Guanylate cyclase soluble subunit alpha-1
Ligand
BDBM281732
Substrate
Meas. Tech.
Stimulation of sGC Enzyme Activity
pH
7.5±n/a
Temperature
298.15±n/a K
EC50
5.20±n/a nM
Comments
extracted
Citation
 Hahn, MLampe, TStasch, JSchlemmer, KWunder, FLi, VMBecker-Pelster, EStoll, FKnorr, AWoltering, E Branched 3-phenylpropionic acid derivatives and their use US Patent  US10023528 Publication Date 7/17/2018 
Target
Name:
Guanylate cyclase soluble subunit alpha-1
Synonyms:
GCS-alpha-1 GCYA1_HUMAN GUCSA3 GUCY1A3 Guanylate cyclase soluble subunit alpha-3 Solube guanylate cyclase alpha-1 (sGCalpha) | soluble guanylate cyclase alpha-1 (sGC)
Type:
Enzyme
Mol. Mass.:
77457.21
Organism:
Homo sapiens (Human)
Description:
Q02108
Residue:
690
  
Inhibitor
Name:
BDBM281732
Synonyms:
US10023528, Example 5 US10259776, Example 6
Type:
Small organic molecule
Emp. Form.:
C25H26Cl2F3NO3
Mol. Mass.:
516.38
SMILES:
C[C@H]([C@H](C(=O)Nc1cc(ccc1Cl)C(C)(CC(O)=O)C1CCC1)c1ccc(Cl)cc1)C(F)(F)F
: