Target
Guanylate cyclase soluble subunit alpha-1
Ligand
BDBM281739
Substrate
Meas. Tech.
Stimulation of sGC Enzyme Activity
pH
7.5±n/a
Temperature
298.15±n/a K
EC50
220±n/a nM
Comments
extracted
Citation
 Hahn, MLampe, TStasch, JSchlemmer, KWunder, FLi, VMBecker-Pelster, EStoll, FKnorr, AWoltering, E Branched 3-phenylpropionic acid derivatives and their use US Patent  US10023528 Publication Date 7/17/2018 
Target
Name:
Guanylate cyclase soluble subunit alpha-1
Synonyms:
GCS-alpha-1 GCYA1_HUMAN GUCSA3 GUCY1A3 Guanylate cyclase soluble subunit alpha-3 Solube guanylate cyclase alpha-1 (sGCalpha) | soluble guanylate cyclase alpha-1 (sGC)
Type:
Enzyme
Mol. Mass.:
77457.21
Organism:
Homo sapiens (Human)
Description:
Q02108
Residue:
690
  
Inhibitor
Name:
BDBM281739
Synonyms:
US10023528, Example 25 | US10259776, Example 25
Type:
Small organic molecule
Emp. Form.:
C24H26Cl2F3NO4
Mol. Mass.:
520.369
SMILES:
COC(C)(C)C(CC(O)=O)c1ccc(Cl)c(NC(=O)[C@@H]([C@@H](C)C(F)(F)F)c2ccc(Cl)cc2)c1
: