Target
Prolyl hydroxylase EGLN3
Ligand
BDBM107695
Substrate
Meas. Tech.
Enzyme Assay
IC50
2.14e+4±n/a nM
Citation
 Kawamoto, RMWu, SWarshakoon, NCEvdokimov, AGGreis, KDBoyer, AS Prolyl hydroxylase inhibitors and methods of use US Patent  US8598210 Publication Date 12/3/2013 
Target
Name:
Prolyl hydroxylase EGLN3
Synonyms:
EGLN3 Egl nine homolog 3 (EGLIN3) | Egl nine homolog 3 (EGLN3)
Type:
Protein
Mol. Mass.:
27265.54
Organism:
Homo sapiens (Human)
Description:
Q9H6Z9
Residue:
239
  
Inhibitor
Name:
BDBM107695
Synonyms:
US11426393, Compound Table XV.1 US8722895, 1: {[5-(3-chloro-phenyl)-3-hydroxy-pyridine-2- carbonyl]-amino}-acetic acid methyl ester USRE47437, Example {[5-(3-chloro-phenyl)-3-hydroxy-pyridine-2-carbonyl]-amino}-acetic acid methyl ester
Type:
Small organic molecule
Emp. Form.:
C15H13ClN2O4
Mol. Mass.:
320.728
SMILES:
COC(=O)CNC(=O)c1ncc(cc1O)-c1cccc(Cl)c1
: