Target
cGMP-dependent 3',5'-cyclic phosphodiesterase
Ligand
BDBM47122
Substrate
Meas. Tech.
Inhibition Assay
IC50
1.25±0.0 nM
Citation
 Helal, CJChappie, TAHumphrey, JMVerhoest, PRYang, E Imidazo[5,1-f][1,2,4]triazines for the treatment of neurological disorders US Patent  US8598155 Publication Date 12/3/2013 
Target
Name:
cGMP-dependent 3',5'-cyclic phosphodiesterase
Synonyms:
CGS-PDE Homo sapiens phosphodiesterase 2A (PDE2A) PDE2A cGSPDE
Type:
Enzyme Catalytic Domain
Mol. Mass.:
105691.58
Organism:
Homo sapiens (Human)
Description:
O00408
Residue:
941
  
Inhibitor
Name:
BDBM47122
Synonyms:
US8598155, 10 | US8598155, 3
Type:
Emp. Form.:
C18H16F3N7
Mol. Mass.:
387.3617
SMILES:
CNc1ncnn2c(C)nc(-c3cnn(C)c3-c3ccc(cc3)C(F)(F)F)c12
: