Target
cGMP-dependent 3',5'-cyclic phosphodiesterase
Ligand
BDBM107769
Substrate
Meas. Tech.
Inhibition Assay
IC50
1.26±0.0 nM
Citation
 Helal, CJChappie, TAHumphrey, JMVerhoest, PRYang, E Imidazo[5,1-f][1,2,4]triazines for the treatment of neurological disorders US Patent  US8598155 Publication Date 12/3/2013 
Target
Name:
cGMP-dependent 3',5'-cyclic phosphodiesterase
Synonyms:
CGS-PDE Homo sapiens phosphodiesterase 2A (PDE2A) PDE2A cGSPDE
Type:
Enzyme Catalytic Domain
Mol. Mass.:
105691.58
Organism:
Homo sapiens (Human)
Description:
O00408
Residue:
941
  
Inhibitor
Name:
BDBM107769
Synonyms:
US8598155, 4 | US8598155, 86
Type:
Small organic molecule
Emp. Form.:
C19H18ClN7
Mol. Mass.:
379.846
SMILES:
Cc1nc(-c2cnn(C)c2-c2ccc(Cl)cc2)c2c(ncnn12)N1CCC1
: