Target
Amine oxidase [flavin-containing] B
Ligand
BDBM108060
Substrate
Meas. Tech.
MAO Assay
pH
7.4±n/a
Temperature
310.15±n/a K
Ki
5.9e+4± 9e+3 nM
Comments
extracted
Citation
 Coelho-Cerqueira, ENetz, PAdo Canto, VPPinto, ACFollmer, C Beyond topoisomerase inhibition: antitumor 1,4-naphthoquinones as potential inhibitors of human monoamine oxidase. Chem Biol Drug Des 83:401-10 (2014)  
Target
Name:
Amine oxidase [flavin-containing] B
Synonyms:
AOFB_HUMAN MAOB Monoamine oxidase type B (MAO B) Monoamine oxidase type B (MAOB)
Type:
Protein
Mol. Mass.:
58768.76
Organism:
Homo sapiens (Human)
Description:
P27338
Residue:
520
  
Inhibitor
Name:
BDBM108060
Synonyms:
4-hydroxy-3-(3-methylbut-2-enyl)naphthalene-1,2-dione | Lapachol
Type:
Small organic molecule
Emp. Form.:
C15H14O3
Mol. Mass.:
242.2699
SMILES:
[#6]\[#6](-[#6])=[#6]\[#6]-[#6]-1-[#6](=O)-[#6](=O)-c2ccccc2-[#6]-1=O
: