Target
Secreted chorismate mutase
Ligand
BDBM108083
Substrate
Meas. Tech.
CM Assay
Temperature
310.15±n/a K
IC50
1.01e+3± 2.2e+2 nM
Comments
extracted
Citation
 Jeankumar, VUAlokam, RSridevi, JPSuryadevara, PMatikonda, SSPeddi, SSahithi, SAlvala, MYogeeswari, PSriram, D Discovery and Structure Optimization of a Series of Isatin Derivatives as Mycobacterium tuberculosis Chorismate Mutase Inhibitors. Chem Biol Drug Des 83:498-506 (2014)  
Target
Name:
Secreted chorismate mutase
Synonyms:
Chorismate mutase (CM) Chorismate mutase-related protein | SCMU_MYCTU
Type:
Protein
Mol. Mass.:
21942.03
Organism:
Mycobacterium tuberculosis H37Rv
Description:
Residue:
199
  
Inhibitor
Name:
BDBM108083
Synonyms:
3-(4-nitrobenzylidene)indolin-2-one (Compound 24)
Type:
Small organic molecule
Emp. Form.:
C15H10N2O3
Mol. Mass.:
266.2515
SMILES:
[O-][N+](=O)c1ccc(\C=C2/C(=O)Nc3ccccc23)cc1
: