Target
Vitamin K-dependent protein C
Ligand
BDBM47178
Substrate
Meas. Tech.
Inhibition Assay
Ki
27±0.0 nM
Citation
 Herold, PDaghish, MJelakovic, SLudwig, FReichelt, CSchulze, ASchweinitz, A Trypsin-like serine protease inhibitors, and their preparation and use US Patent  US8598206 Publication Date 12/3/2013 
Target
Name:
Vitamin K-dependent protein C
Synonyms:
Activated protein C cofactor Apolipoprotein H Blood coagulation factor XIV Coagulation factor V heavy chain Endothelial protein C receptor PROC_HUMAN Vitamin K-dependent protein C precursor
Type:
Enzyme
Mol. Mass.:
52067.73
Organism:
Homo sapiens (Human)
Description:
Residue:
461
  
Inhibitor
Name:
BDBM47178
Synonyms:
BDBM108103 | US8598206, Table 6, 12
Type:
Emp. Form.:
C33H43N7O4S
Mol. Mass.:
633.804
SMILES:
NC(=N)c1ccc(CNC(=O)[C@H](CCC2CCNCC2)NC(=O)[C@@H](CCc2ccncc2)NS(=O)(=O)Cc2ccccc2)cc1
: