Target
Transcription initiation factor IIA subunit 1
Ligand
BDBM108098
Substrate
Meas. Tech.
Inhibition Assay
Ki
8500±0.0 nM
Citation
 Herold, PDaghish, MJelakovic, SLudwig, FReichelt, CSchulze, ASchweinitz, A Trypsin-like serine protease inhibitors, and their preparation and use US Patent  US8598206 Publication Date 12/3/2013 
Target
Name:
Transcription initiation factor IIA subunit 1
Synonyms:
GTF2A1 TF2AA_HUMAN | Transcription initiation factor IIA
Type:
Enzyme
Mol. Mass.:
41485.12
Organism:
Homo sapiens (Human)
Description:
P52655
Residue:
376
  
Inhibitor
Name:
BDBM108098
Synonyms:
US8598206, Table 6, 7
Type:
Small organic molecule
Emp. Form.:
C37H53N7O5S
Mol. Mass.:
707.926
SMILES:
NC(=N)c1ccc(CNC(=O)[C@H](CCC2CCNCC2)NC(=O)[C@@H](CCC2CCN(CC2)C(=O)C2CC2)NS(=O)(=O)Cc2ccccc2)cc1
: