Target
Lysosomal acid glucosylceramidase
Ligand
BDBM108215
Substrate
Meas. Tech.
GCase IC50 Assay
pH
5.2±0
IC50
91.6±0.0 nM
Citation
 Li, ZLi, TDai, SXie, XMa, XZhao, WZhang, WLi, JWang, PG New insights into the pharmacological chaperone activity of c2-substituted glucoimidazoles for the treatment of Gaucher disease. Chembiochem 14:1239-47 (2013)  
Target
Name:
Lysosomal acid glucosylceramidase
Synonyms:
Acid beta-glucosidase Beta-glucocerebrosidase D-glucosyl-N-acylsphingosine glucohydrolase GBA1 GC GLUC Glucosylceramidase (GBA) Glucosylceramidase precursor (Beta-glucocerebrosidase) (Acid beta-glucosidase) (D-glucosyl-N-acylsphingosine glucohydrolase) (Alglucerase) (Imiglucerase) beta-glucocerebrosidase (GCase)
Type:
Enzyme
Mol. Mass.:
59724.64
Organism:
Homo sapiens (Human)
Description:
The beta-Glu activity was measured with commercially available beta-glucocerebrosidase (Ceredase) as the enzyme source.
Residue:
536
  
Inhibitor
Name:
BDBM108215
Synonyms:
5-(hydroxymethyl)-5H,6H,7H,8H-imidazo[1,2- a]pyridine-6,7,8-triol (Compound 1)
Type:
Small organic molecule
Emp. Form.:
C8H12N2O4
Mol. Mass.:
200.1919
SMILES:
OCC1C(O)C(O)C(O)c2nccn12
: