Target
Lysosomal acid glucosylceramidase
Ligand
BDBM50156357
Substrate
Meas. Tech.
GCase IC50 Assay
pH
5.2±0
IC50
979±0.0 nM
Citation
 Li, ZLi, TDai, SXie, XMa, XZhao, WZhang, WLi, JWang, PG New insights into the pharmacological chaperone activity of c2-substituted glucoimidazoles for the treatment of Gaucher disease. Chembiochem 14:1239-47 (2013)  
Target
Name:
Lysosomal acid glucosylceramidase
Synonyms:
Acid beta-glucosidase Beta-glucocerebrosidase D-glucosyl-N-acylsphingosine glucohydrolase GBA1 GC GLUC Glucosylceramidase (GBA) Glucosylceramidase precursor (Beta-glucocerebrosidase) (Acid beta-glucosidase) (D-glucosyl-N-acylsphingosine glucohydrolase) (Alglucerase) (Imiglucerase) beta-glucocerebrosidase (GCase)
Type:
Enzyme
Mol. Mass.:
59724.64
Organism:
Homo sapiens (Human)
Description:
The beta-Glu activity was measured with commercially available beta-glucocerebrosidase (Ceredase) as the enzyme source.
Residue:
536
  
Inhibitor
Name:
BDBM50156357
Synonyms:
2-Hydroxymethyl-1-nonyl-piperidine-3,4,5-triol NN-DNJ
Type:
Small organic molecule
Emp. Form.:
C15H31NO4
Mol. Mass.:
289.4109
SMILES:
CCCCCCCCCN1CC(O)C(O)C(O)C1CO
: