Target
Prunasin hydrolase
Ligand
BDBM108224
Substrate
Meas. Tech.
Inhibition Assay Against Commercial Glycosidases
pH
10.6±n/a
Temperature
310.15±n/a K
IC50
140±n/a nM
Comments
extracted
Citation
 Li, ZLi, TDai, SXie, XMa, XZhao, WZhang, WLi, JWang, PG New insights into the pharmacological chaperone activity of c2-substituted glucoimidazoles for the treatment of Gaucher disease. Chembiochem 14:1239-47 (2013)  
Target
Name:
Prunasin hydrolase
Synonyms:
β-glucosidase | Prunasin hydrolase
Type:
Protein
Mol. Mass.:
61905.54
Organism:
Prunus dulcis (Almond)
Description:
Residue:
544
  
Inhibitor
Name:
BDBM108224
Synonyms:
N-phenyl-4-[6,7,8-trihydroxy-5-(hydroxymethyl)- 5H,6H,7H,8H-imidazo[1,2-a]pyridin-2-yl]butanamide (Compound 10)
Type:
Small organic molecule
Emp. Form.:
C18H23N3O5
Mol. Mass.:
361.3923
SMILES:
OCC1C(O)C(O)C(O)c2nc(CCCC(=O)Nc3ccccc3)cn12
: