Target
Oligo-1,6-glucosidase IMA1
Ligand
BDBM108223
Substrate
Meas. Tech.
Inhibition Assay Against Commercial Glycosidases
pH
10.6±n/a
Temperature
310.15±n/a K
IC50
7.3e+2±n/a nM
Comments
extracted
Citation
 Li, ZLi, TDai, SXie, XMa, XZhao, WZhang, WLi, JWang, PG New insights into the pharmacological chaperone activity of c2-substituted glucoimidazoles for the treatment of Gaucher disease. Chembiochem 14:1239-47 (2013)  
Target
Name:
Oligo-1,6-glucosidase IMA1
Synonyms:
α-glucosidase Alpha-glucosidase (α-glucosidase) MALX3_YEAST | Oligo-1,6-glucosidase
Type:
Protein
Mol. Mass.:
68577.59
Organism:
Saccharomyces cerevisiae S288c (Baker's yeast)
Description:
Residue:
589
  
Inhibitor
Name:
BDBM108223
Synonyms:
2-[3-(4-fluorophenyl)propyl]-5-(hydroxymethyl)- 5H,6H,7H,8H-imidazo[1,2-a]pyridine-6,7,8-triol (Compound 9)
Type:
Small organic molecule
Emp. Form.:
C17H21FN2O4
Mol. Mass.:
336.358
SMILES:
OCC1C(O)C(O)C(O)c2nc(CCCc3ccc(F)cc3)cn12
: