Target
Fatty-acid amide hydrolase 1 [33-574]
Ligand
BDBM108236
Substrate
IC50
5.8e+4± 2.1e+4 nM
Citation
 Lambruschini, CVeronesi, MRomeo, EGarau, GBandiera, TPiomelli, DScarpelli, RDalvit, C Development of fragment-based n-FABS NMR screening applied to the membrane enzyme FAAH. Chembiochem 14:1611-9 (2013)  
Target
Name:
Fatty-acid amide hydrolase 1 [33-574]
Synonyms:
FAAH1_RAT Faah1 | Fatty-acid amide hydrolase (rFAAH∆TM)
Type:
Protein
Mol. Mass.:
59459.86
Organism:
Rattus norvegicus (Rat)
Description:
97-1722bp
Residue:
542
  
Inhibitor
Name:
BDBM108236
Synonyms:
2‐fluoro‐4‐methanesulfonylaniline (Hit 4)
Type:
Small organic molecule
Emp. Form.:
C7H8FNO2S
Mol. Mass.:
189.207
SMILES:
CS(=O)(=O)c1ccc(N)c(F)c1
: