Target
Fatty-acid amide hydrolase 1 [33-574]
Ligand
BDBM108244
Substrate
IC50
5.63e+5± 3.6e+4 nM
Citation
 Lambruschini, CVeronesi, MRomeo, EGarau, GBandiera, TPiomelli, DScarpelli, RDalvit, C Development of fragment-based n-FABS NMR screening applied to the membrane enzyme FAAH. Chembiochem 14:1611-9 (2013)  
Target
Name:
Fatty-acid amide hydrolase 1 [33-574]
Synonyms:
FAAH1_RAT Faah1 | Fatty-acid amide hydrolase (rFAAH∆TM)
Type:
Protein
Mol. Mass.:
59459.86
Organism:
Rattus norvegicus (Rat)
Description:
97-1722bp
Residue:
542
  
Inhibitor
Name:
BDBM108244
Synonyms:
(1S)‐2,2,2‐trifluoro‐1‐phenylethanol (Hit 12)
Type:
Small organic molecule
Emp. Form.:
C8H7F3O
Mol. Mass.:
176.1358
SMILES:
O[C@@H](c1ccccc1)C(F)(F)F
: