Target
Fatty-acid amide hydrolase 1 [33-574]
Ligand
BDBM50437217
Substrate
IC50
4000±600 nM
Citation
 Lambruschini, CVeronesi, MRomeo, EGarau, GBandiera, TPiomelli, DScarpelli, RDalvit, C Development of fragment-based n-FABS NMR screening applied to the membrane enzyme FAAH. Chembiochem 14:1611-9 (2013)  
Target
Name:
Fatty-acid amide hydrolase 1 [33-574]
Synonyms:
FAAH1_RAT Faah1 | Fatty-acid amide hydrolase (rFAAH∆TM)
Type:
Protein
Mol. Mass.:
59459.86
Organism:
Rattus norvegicus (Rat)
Description:
97-1722bp
Residue:
542
  
Inhibitor
Name:
BDBM50437217
Synonyms:
2‐(3‐carbamoylphenyl)‐4‐ [(cyclohexylcarbamoyl)oxy]benzoic acid (Compound 4) | CHEMBL2402923
Type:
Small organic molecule
Emp. Form.:
C21H22N2O5
Mol. Mass.:
382.4098
SMILES:
NC(=O)c1cccc(c1)-c1cc(OC(=O)NC2CCCCC2)ccc1C(O)=O
: