Target
Tyrosine-protein kinase BTK
Ligand
BDBM281748
Substrate
Meas. Tech.
Human Recombinant Btk Enzyme Assay
pH
7.4±n/a
Temperature
298.15±n/a K
IC50
0.180±n/a nM
Comments
extracted
Citation
 Watterson, SHTebben, AJAhmad, S Carbazole and tetrahydrocarbazole compounds useful as inhibitors of BTK US Patent  US10023534 Publication Date 7/17/2018 
Target
Name:
Tyrosine-protein kinase BTK
Synonyms:
AGMX1 Agammaglobulinaemia tyrosine kinase B cell progenitor kinase BPK BTK_HUMAN Tyrosine Kinase BTK Tyrosine-protein kinase BTK (BTK)
Type:
Enzyme
Mol. Mass.:
76289.95
Organism:
Homo sapiens (Human)
Description:
Q06187
Residue:
659
  
Inhibitor
Name:
BDBM281748
Synonyms:
4-(2-Acryloyl-1,2,3,4-tetrahydroisoquinolin-5-yl)-3-fluoro-7-(trifluoromethyl)-9H-carbazole-1-carboxamide (Single Enantiomeric Atropisomer) | US10023534, Example 7
Type:
Small organic molecule
Emp. Form.:
C26H19F4N3O2
Mol. Mass.:
481.4416
SMILES:
NC(=O)c1cc(F)c(-c2cccc3CN(CCc23)C(=O)C=C)c2c3ccc(cc3[nH]c12)C(F)(F)F
: