Target
Tyrosine-protein kinase BTK
Ligand
BDBM281751
Substrate
Meas. Tech.
Human Recombinant Btk Enzyme Assay
pH
7.4±n/a
Temperature
298.15±n/a K
IC50
0.130±n/a nM
Comments
extracted
Citation
 Watterson, SHTebben, AJAhmad, S Carbazole and tetrahydrocarbazole compounds useful as inhibitors of BTK US Patent  US10023534 Publication Date 7/17/2018 
Target
Name:
Tyrosine-protein kinase BTK
Synonyms:
AGMX1 Agammaglobulinaemia tyrosine kinase B cell progenitor kinase BPK BTK_HUMAN Tyrosine Kinase BTK Tyrosine-protein kinase BTK (BTK)
Type:
Enzyme
Mol. Mass.:
76289.95
Organism:
Homo sapiens (Human)
Description:
Q06187
Residue:
659
  
Inhibitor
Name:
BDBM281751
Synonyms:
5-(2-Acryloyl-1,2,3,4-tetrahydroisoquinolin-5-yl)-6-fluoro-2-(trifluoromethyl)-2,3,4,9-tetrahydro-1H-carbazole-8-carboxamide, Single Homochiral Diastereomers US10023534, Example 11
Type:
Small organic molecule
Emp. Form.:
C26H23F4N3O2
Mol. Mass.:
485.4733
SMILES:
NC(=O)c1cc(F)c(-c2cccc3CN(CCc23)C(=O)C=C)c2c3CCC(Cc3[nH]c12)C(F)(F)F
: