Target
Adenosine receptor A2
Ligand
BDBM108256
Substrate
Meas. Tech.
Binding Assay
Ki
951±0.0 nM
Citation
 Jagtap, PSzabo, CSalzman, AL Purine derivatives as adenosine A1 receptor agonists and methods of use thereof US Patent  US8609833 Publication Date 12/17/2013 
Target
Name:
Adenosine receptor A2
Synonyms:
ADORA2A | C9JQD8_HUMAN
Type:
Enzyme
Mol. Mass.:
40112.08
Organism:
Homo sapiens (Human)
Description:
C9JQD8
Residue:
365
  
Inhibitor
Name:
BDBM108256
Synonyms:
CHEMBL2205239 | US8609833, 87
Type:
Small organic molecule
Emp. Form.:
C10H12N6O6
Mol. Mass.:
312.2389
SMILES:
Nc1ncnc2n(cnc12)[C@@H]1O[C@H](CO[N+]([O-])=O)[C@@H](O)[C@H]1O
: