Target
Histamine H3 receptor
Ligand
BDBM108284
Substrate
Meas. Tech.
Radioligand Binding Assay
Ki
0.06±0.0 nM
Citation
 Gao, ZHall, DHartung, R Substituted piperidine spiro pyrrolidinone and piperidinone, preparation and therapeutic use thereof US Patent  US8604046 Publication Date 12/10/2013 
Target
Name:
Histamine H3 receptor
Synonyms:
Type:
Enzyme
Mol. Mass.:
43426.88
Organism:
Macaca mulatta (Rhesus macaque)
Description:
G7N499
Residue:
390
  
Inhibitor
Name:
BDBM108284
Synonyms:
US8604046, 64
Type:
Small organic molecule
Emp. Form.:
C24H35FN4O
Mol. Mass.:
414.5593
SMILES:
C[C@H]1CCCN1[C@H]1CCN(C1)c1ccc(N2CCCC3(CCNCC3)C2=O)c(F)c1
: