Target
Serine/threonine-protein kinase pim-1
Ligand
BDBM108404
Substrate
Meas. Tech.
Luminometric Kinase Assay
pH
7±0
IC50
18.84±0.0 nM
Citation
 Brzózka, KCzardybon, WSabiniarz, AMillik, MWindak, RZarebski, ABeuzen, N Compound, a process for its preparation, a pharmaceutical composition, use of a compound, a method for modulating or regulating serine/threonine kinases and a serine/threonine kinases modulating agent US Patent  US8604217 Publication Date 12/10/2013 
Target
Name:
Serine/threonine-protein kinase pim-1
Synonyms:
PIM-1 Kinase PIM1_HUMAN Serine/threonine-protein kinase (PIM1) Serine/threonine-protein kinase PIM1 | Serine/threonine-protein kinase pim-1 (PIM1)
Type:
Protein
Mol. Mass.:
35681.82
Organism:
Homo sapiens (Human)
Description:
P11309
Residue:
313
  
Inhibitor
Name:
BDBM108404
Synonyms:
US8604217, 336
Type:
Small organic molecule
Emp. Form.:
C13H14Br4N4
Mol. Mass.:
545.893
SMILES:
NC1CCCC(C1)Nc1nc2c(Br)c(Br)c(Br)c(Br)c2[nH]1
: