Target
Serine/threonine-protein kinase pim-1
Ligand
BDBM108406
Substrate
Meas. Tech.
Luminometric Kinase Assay
pH
7±0
IC50
21.71±0.0 nM
Citation
 Brzózka, KCzardybon, WSabiniarz, AMillik, MWindak, RZarebski, ABeuzen, N Compound, a process for its preparation, a pharmaceutical composition, use of a compound, a method for modulating or regulating serine/threonine kinases and a serine/threonine kinases modulating agent US Patent  US8604217 Publication Date 12/10/2013 
Target
Name:
Serine/threonine-protein kinase pim-1
Synonyms:
PIM-1 Kinase PIM1_HUMAN Serine/threonine-protein kinase (PIM1) Serine/threonine-protein kinase PIM1 | Serine/threonine-protein kinase pim-1 (PIM1)
Type:
Protein
Mol. Mass.:
35681.82
Organism:
Homo sapiens (Human)
Description:
P11309
Residue:
313
  
Inhibitor
Name:
BDBM108406
Synonyms:
US8604217, 338
Type:
Small organic molecule
Emp. Form.:
C16H18Br4N4O
Mol. Mass.:
601.956
SMILES:
Brc1c(Br)c(Br)c2[nH]c(N[C@H]3COC[C@@H]3N3CCCCC3)nc2c1Br
: