Target
Lysosomal acid glucosylceramidase
Ligand
BDBM108419
Substrate
Meas. Tech.
Enzyme Inhibition Assay
pH
5.2±0
Ki
142± 8.8 nM
IC50
343± 2.1 nM
Citation
 Boyd, RLee, GRybczynski, P Compositions for preventing and/or treating degenerative disorders of the central nervous system US Patent  US8604206 Publication Date 12/10/2013 
Target
Name:
Lysosomal acid glucosylceramidase
Synonyms:
Acid beta-glucosidase Beta-glucocerebrosidase D-glucosyl-N-acylsphingosine glucohydrolase GBA1 GC GLUC Glucosylceramidase (GBA) Glucosylceramidase precursor (Beta-glucocerebrosidase) (Acid beta-glucosidase) (D-glucosyl-N-acylsphingosine glucohydrolase) (Alglucerase) (Imiglucerase) beta-glucocerebrosidase (GCase)
Type:
Enzyme
Mol. Mass.:
59724.64
Organism:
Homo sapiens (Human)
Description:
The beta-Glu activity was measured with commercially available beta-glucocerebrosidase (Ceredase) as the enzyme source.
Residue:
536
  
Inhibitor
Name:
BDBM108419
Synonyms:
US8604206, 10 | US8604206, 9
Type:
Small organic molecule
Emp. Form.:
C7H15NO3
Mol. Mass.:
161.1989
SMILES:
CC(O)[C@H]1CNC[C@@H](O)[C@@H]1O
: