Target
Lysosomal acid glucosylceramidase
Ligand
BDBM108422
Substrate
Meas. Tech.
Enzyme Inhibition Assay
pH
5.2±0
Ki
273± 12 nM
IC50
659± 28 nM
Citation
 Boyd, RLee, GRybczynski, P Compositions for preventing and/or treating degenerative disorders of the central nervous system US Patent  US8604206 Publication Date 12/10/2013 
Target
Name:
Lysosomal acid glucosylceramidase
Synonyms:
Acid beta-glucosidase Beta-glucocerebrosidase D-glucosyl-N-acylsphingosine glucohydrolase GBA1 GC GLUC Glucosylceramidase (GBA) Glucosylceramidase precursor (Beta-glucocerebrosidase) (Acid beta-glucosidase) (D-glucosyl-N-acylsphingosine glucohydrolase) (Alglucerase) (Imiglucerase) beta-glucocerebrosidase (GCase)
Type:
Enzyme
Mol. Mass.:
59724.64
Organism:
Homo sapiens (Human)
Description:
The beta-Glu activity was measured with commercially available beta-glucocerebrosidase (Ceredase) as the enzyme source.
Residue:
536
  
Inhibitor
Name:
BDBM108422
Synonyms:
US8604206, (3R,4R,5S)-5-benzyl-piperidine-3,4-diol
Type:
Small organic molecule
Emp. Form.:
C12H17NO2
Mol. Mass.:
207.2689
SMILES:
O[C@@H]1CNC[C@H](Cc2ccccc2)[C@H]1O
: