Target
Glutaminase kidney isoform, mitochondrial
Ligand
BDBM47226
Substrate
Meas. Tech.
Enzyme Assay-Time Dependence
IC50
480±n/a nM
Citation
 Li, JChen, LGoyal, BLaidig, GStanton, TFSjogren, EB Heterocyclic inhibitors of glutaminase US Patent  US8604016 Publication Date 12/10/2013 
Target
Name:
Glutaminase kidney isoform, mitochondrial
Synonyms:
GLS GLSK_HUMAN K-glutaminase L-glutamine amidohydrolase
Type:
Protein
Mol. Mass.:
73471.89
Organism:
Homo sapiens (Human)
Description:
O94925
Residue:
669
  
Inhibitor
Name:
BDBM47226
Synonyms:
US8604016, 638 | US9938267, Cmpd ID 638
Type:
Emp. Form.:
C22H22N8O2S3
Mol. Mass.:
526.657
SMILES:
O=C(Cc1cccnc1)Nc1nnc(CCSCCc2nnc(NC(=O)Cc3cccnc3)s2)s1
: