Target
Glutaminase kidney isoform, mitochondrial
Ligand
BDBM108859
Substrate
Meas. Tech.
Enzyme Assay-Time Dependence
IC50
2.5e+2±n/a nM
Citation
 Li, JChen, LGoyal, BLaidig, GStanton, TFSjogren, EB Heterocyclic inhibitors of glutaminase US Patent  US8604016 Publication Date 12/10/2013 
Target
Name:
Glutaminase kidney isoform, mitochondrial
Synonyms:
GLS GLSK_HUMAN K-glutaminase L-glutamine amidohydrolase
Type:
Protein
Mol. Mass.:
73471.89
Organism:
Homo sapiens (Human)
Description:
O94925
Residue:
669
  
Inhibitor
Name:
BDBM108859
Synonyms:
US8604016, 439 | US9938267, Cmpd ID 439
Type:
Small organic molecule
Emp. Form.:
C30H31ClN6O4S
Mol. Mass.:
607.123
SMILES:
CCCC(=O)OC(C(=O)Nc1nnc(CCCCc2ccc(NC(=O)Cc3ccccc3)nn2)s1)c1cccc(Cl)c1
: