Target
Glutaminase kidney isoform, mitochondrial
Ligand
BDBM108873
Substrate
Meas. Tech.
Enzyme Assay-Time Dependence
IC50
3±n/a nM
Citation
 Li, JChen, LGoyal, BLaidig, GStanton, TFSjogren, EB Heterocyclic inhibitors of glutaminase US Patent  US8604016 Publication Date 12/10/2013 
Target
Name:
Glutaminase kidney isoform, mitochondrial
Synonyms:
GLS GLSK_HUMAN K-glutaminase L-glutamine amidohydrolase
Type:
Protein
Mol. Mass.:
73471.89
Organism:
Homo sapiens (Human)
Description:
O94925
Residue:
669
  
Inhibitor
Name:
BDBM108873
Synonyms:
US8604016, 453 | US9938267, Cmpd ID 453
Type:
Small organic molecule
Emp. Form.:
C30H34N8O3S
Mol. Mass.:
586.708
SMILES:
CCNC(=O)NCc1cccc(CC(=O)Nc2nnc(CCCCc3ccc(NC(=O)Cc4ccccc4)nn3)s2)c1
: