Target
Glutaminase kidney isoform, mitochondrial
Ligand
BDBM109064
Substrate
Meas. Tech.
Enzyme Assay-Time Dependence
IC50
4±n/a nM
Citation
 Li, JChen, LGoyal, BLaidig, GStanton, TFSjogren, EB Heterocyclic inhibitors of glutaminase US Patent  US8604016 Publication Date 12/10/2013 
Target
Name:
Glutaminase kidney isoform, mitochondrial
Synonyms:
GLS GLSK_HUMAN K-glutaminase L-glutamine amidohydrolase
Type:
Protein
Mol. Mass.:
73471.89
Organism:
Homo sapiens (Human)
Description:
O94925
Residue:
669
  
Inhibitor
Name:
BDBM109064
Synonyms:
US8604016, 648 | US9938267, Cmpd ID 648
Type:
Small organic molecule
Emp. Form.:
C30H30N8O3S
Mol. Mass.:
582.676
SMILES:
Cc1noc(Cc2cccc(CC(=O)Nc3ccc(CCCCc4nnc(NC(=O)Cc5ccccc5)s4)nn3)c2)n1
: