Target
Glutaminase kidney isoform, mitochondrial
Ligand
BDBM108675
Substrate
Meas. Tech.
Enzyme Assay
IC50
3.8e+2±n/a nM
Citation
 Li, JChen, LGoyal, BLaidig, GStanton, TFSjogren, EB Heterocyclic inhibitors of glutaminase US Patent  US8604016 Publication Date 12/10/2013 
Target
Name:
Glutaminase kidney isoform, mitochondrial
Synonyms:
GLS GLSK_HUMAN K-glutaminase L-glutamine amidohydrolase
Type:
Protein
Mol. Mass.:
73471.89
Organism:
Homo sapiens (Human)
Description:
O94925
Residue:
669
  
Inhibitor
Name:
BDBM108675
Synonyms:
US8604016, 255
Type:
Small organic molecule
Emp. Form.:
C24H22Cl2N6O2S3
Mol. Mass.:
593.571
SMILES:
Clc1ccccc1CC(=O)Nc1nnc(CCSCCc2nnc(NC(=O)Cc3ccccc3Cl)s2)s1
: