Target
SGLT1 protein
Ligand
BDBM109276
Substrate
Meas. Tech.
Inhibition Assay
IC50
>2000±0.0 nM
Citation
 Yang, FTang, PCDong, QTu, WFan, JGuan, DShen, GWang, YYuan, JZhang, L C-aryl glucoside derivatives, preparation process and pharmaceutical use thereof US Patent  US8609622 Publication Date 12/17/2013 
Target
Name:
SGLT1 protein
Synonyms:
Q9QXI6_MOUSE Sglt1 Solute carrier family 5 (Sodium/glucose cotransporter), member 1 sodium-dependent glucose cotransporter 1 (SGLT1)
Type:
Protein
Mol. Mass.:
73320.01
Organism:
Mus musculus (Mouse)
Description:
Q9QXI6
Residue:
665
  
Inhibitor
Name:
BDBM109276
Synonyms:
US8609622, 3
Type:
Small organic molecule
Emp. Form.:
C22H23ClF2O7
Mol. Mass.:
472.864
SMILES:
CCOc1ccc(Cc2cc(ccc2Cl)C23OC[C@@](CO)(O2)[C@@H](O)[C@H](O)[C@H]3O)c(F)c1F
: