Target
Enteropeptidase
Ligand
BDBM109637
Substrate
Meas. Tech.
Inhibition Assay
Ki
0.33±0.0 nM
Citation
 Konishi, ATokumasu, MSuzuki, TKoshiba, TOhsumi, KIkehara, OKodama, Y Heteroarylcarboxylic acid ester derivative US Patent  US8609715 Publication Date 12/17/2013 
Target
Name:
Enteropeptidase
Synonyms:
ENTK PRSS7 | TMPRSS15
Type:
Enzyme
Mol. Mass.:
112901.62
Organism:
Homo sapiens (Human)
Description:
P98073
Residue:
1019
  
Inhibitor
Name:
BDBM109637
Synonyms:
US8609715, A-44
Type:
Small organic molecule
Emp. Form.:
C20H21N3O8
Mol. Mass.:
431.396
SMILES:
C[C@H](Cc1ccc(o1)C(=O)Oc1ccc(cc1)C(N)=N)C(=O)N[C@@H](CC(O)=O)C(O)=O
: