Target
Enteropeptidase
Ligand
BDBM109687
Substrate
Meas. Tech.
Inhibition Assay
Ki
0.21±0.0 nM
Citation
 Konishi, ATokumasu, MSuzuki, TKoshiba, TOhsumi, KIkehara, OKodama, Y Heteroarylcarboxylic acid ester derivative US Patent  US8609715 Publication Date 12/17/2013 
Target
Name:
Enteropeptidase
Synonyms:
ENTK PRSS7 | TMPRSS15
Type:
Enzyme
Mol. Mass.:
112901.62
Organism:
Homo sapiens (Human)
Description:
P98073
Residue:
1019
  
Inhibitor
Name:
BDBM109687
Synonyms:
US8609715, B-44
Type:
Small organic molecule
Emp. Form.:
C19H20ClN3O8S2
Mol. Mass.:
517.96
SMILES:
CC(Cc1ccc(s1)C(=O)Oc1ccc(cc1Cl)C(N)=N)C(=O)N[C@@H](CS(O)(=O)=O)C(O)=O
: