Target
Tyrosine-protein kinase JAK2
Ligand
BDBM109865
Substrate
Meas. Tech.
Inhibition Assay
IC50
2.2±n/a nM
Citation
 Noji, SShiozaki, MMiura, THara, YYamanaka, HMaeda, KHori, AInoue, MHase, Y Nitrogen-containing spirocyclic compounds and pharmaceutical uses thereof US Patent  US8609647 Publication Date 12/17/2013 
Target
Name:
Tyrosine-protein kinase JAK2
Synonyms:
JAK-2 JAK2_HUMAN Janus kinase 2 (JAK2) | Janus kinase 2 (a protein tyrosine kinase)
Type:
Protein
Mol. Mass.:
130684.68
Organism:
Homo sapiens (Human)
Description:
O60674
Residue:
1132
  
Inhibitor
Name:
BDBM109865
Synonyms:
US8609647, 25 US8609647, 59
Type:
Small organic molecule
Emp. Form.:
C16H18N6O
Mol. Mass.:
310.3537
SMILES:
O=C(CC#N)N1CCC11CCCN(C1)c1ncnc2[nH]ccc12
: