Target
Histone deacetylase 6
Ligand
BDBM109959
Substrate
Meas. Tech.
Enzyme Assays
pH
7.4±0
IC50
3±0.0 nM
Citation
 Van Duzer, JHMazitschek, ROgier, WBradner, JEHuang, GXie, DYu, N Reverse amide compounds as protein deacetylase inhibitors and methods of use thereof US Patent  US8609678 Publication Date 12/17/2013 
Target
Name:
Histone deacetylase 6
Synonyms:
Cereblon/Histone deacetylase 6 HDAC6 Histone deacetylase 6 (HDAC6) KIAA0901 | ORF Names:JM21
Type:
Chromatin regulator; hydrolase; repressor
Mol. Mass.:
131381.51
Organism:
Homo sapiens (Human)
Description:
Q9UBN7
Residue:
1215
  
Inhibitor
Name:
BDBM109959
Synonyms:
US8609678, 4-(2,6-dimethylphenylamino)-N-(7-(hydroxyamino)-7-oxoheptyl)benzamide [11]
Type:
Small organic molecule
Emp. Form.:
C22H29N3O3
Mol. Mass.:
383.484
SMILES:
Cc1cccc(C)c1Nc1ccc(cc1)C(=O)NCCCCCCC(=O)NO
: